{"text_format":"1","workbook":"xlsx","n_sheets":16,"sheets":["Coordonnées","aide ventilation","LIVRE","BILAN","Rapprochement bancaire","Gestion analytique des Projets ","Projets (suite)","Remise espèces","Remise chèques","Pièces =","1","2","3","4","5","6"],"not_rendered":{"charts":0,"images":2,"macros":0,"external_links":0,"defined_names":1,"comments":4,"pivot_tables":0},"unopened":[],"bounds":{"document_bytes":16777216,"sheet_cells":100000,"rows_first":2000,"rows_last":500,"rows_between":2000,"halvings":0,"cell_chars":16384,"cell_head_chars":4096},"cells_cut":0,"cells_raw":0,"read":"whole","date_system":"1900"}

{"sheet":"Coordonnées","index":0,"n_rows":14,"n_cols":2,"rows_kept":14,"cut":false,"hidden":false,"merged":[[0,0,0,1],[8,0,8,1],[12,0,12,1],[13,0,13,1]]}
["Coordonnées de la coopérative scolaire :"]
["Nom de l'école :"]
["Adresse :"]
["Code postal - Ville :"]
["Mandataire (nom, prénom) :"]
["Coopérative n° :"]
["Compte BPO ou C.M.E  n° :"]
[]
["Année scolaire :"]
["de Septembre ",2025]
{"$rows_left_out":5}
{"sheet":"aide ventilation","index":1,"n_rows":11,"n_cols":5,"rows_kept":11,"cut":false,"hidden":false,"merged":[[0,0,0,4],[1,0,1,1],[1,3,1,4]]}
["Ventilation des comptes de charges et produits"]
["PRODUITS",null,null,"CHARGES"]
[70700008,"Ventes de produits pour cessions :\nTout ce que les coopératives cèdent sans l’avoir fabriqué et qui a été payé au compte 6070. La seule indication du montant correspondant à la ristourne laissée à la coopérative, n’est pas correcte. ",null,60700008,"Achats de produits pour cession :\nIl s'agit d'objets achetés pour les revendre : calendrier, photos (argent versé au photographe), revues ou abonnements revendus aux enfants, etc..  (Montant TTC)"]
[70800008,"Produits des activités éducatives :\nRecettes tirées des kermesses, des lotos et des participations demandées pour les activités éducatives… ",null,61810008,"Charges des activités éducatives :\nEnsemble des charges résultant des activités pédagogiques de la coopérative : journaux scolaires, correspondance scolaire, documentation pédagogique, fichiers pédagogiques, sorties éducatives, spectacles, travaux manuels, etc.. "]
[74100008,"Subventions reçues état et coll.locales et établ.publics :\nToutes subventions provenant de l'Etat, des collectivités locales et de ses établissements publics. ",null,61681008,"Assurance versée :\nLe montant se trouve sur la facture d'adhésion que l'OCCE vous a envoyée"]
[75511008,"Contributions financières d'autres organismes :\nAides reçues des associations de parents d’élèves au d’autres associations ou organismes… ",null,65860008,"Cotisation versée à l'OCCE :\nC'est le montant de votre adhésion à l'OCCE, il se trouve sur la facture d'adhésion que l'OCCE vous a envoyée. Ce n'est pas le montant total de votre chèque à l'OCCE puisqu'il y a aussi le montant de l'assurance."]
[75510008,"Contributions financières plateforme participative :\nLe montant reçu par la Trousse à Projet",null,62700008,"Services bancaires et assimilés :\nFrais de renue de comptes, coût de la carte de dépôt, agios, etc"]
[75620008,"Participation volontaires des familles :\nParticipation que les parents donnent en début d'année. Cette participation n'est pas obligatoire.",null,67000008,"Charges exceptionnelles :\nCharges résultant d’un événement imprévu et non récurrent (dons versés, solidarité, etc..). "]
[76700008,"Produits Financiers :\ncomme les placements sont interdits, cette colonne ne sert à rien",null,68000008,"Achats de biens durables :\nil s'agit des matériels qui peuvent être utilisés pendant plusieurs années pour les activités de la coopérative :\nappareil photos, lecteur CD, jumelles, boussoles, .."]
[77000008,"Produits exceptionnels :\nProduits résultant d'un événement imprévu et non récurrent (dons reçus, solidarité, etc..)",null,68000008,"Achats de biens durables :\nGros matériel, équipement durable (durée d’utilisation supérieure à un an) qui figurent au cahier d’inventaire du matériel acheté par la coopérative. La décision d’achat est consignée dans le registre des délibérations de la coopérative (conseil de coopérative) et une copie de la facture est adressée au siège départemental. "]
{"$rows_left_out":2}
{"sheet":"LIVRE","index":2,"n_rows":316,"n_cols":29,"rows_kept":316,"cut":false,"hidden":false,"merged":[[2,26,4,26],[2,27,4,27],[2,28,4,28],[5,0,6,0],[5,1,6,1],[5,2,6,2],[2,20,4,20],[2,22,4,22],[2,23,4,23],[2,24,4,24],[2,25,4,25],[2,15,4,15],[2,16,4,16],[2,17,4,17],[2,18,4,18],[2,19,4,19],[0,13,0,20],[0,22,0,28],[1,0,4,0],[1,1,4,1],[1,3,4,3],[1,4,4,4],[1,5,4,5],[1,6,4,6],[1,7,4,7],[1,8,4,8],[1,9,4,9],[1,10,4,10],[1,11,4,11],[1,21,4,21],[2,13,4,13],[2,14,4,14],[0,0,0,3],[0,4,0,5],[0,6,0,8],[0,9,0,11],[0,12,4,12]]}
[{"$f":"Coordonnées!B2&\" - \"&Coordonnées!B4","v":" - "},null,null,null,"Régies d'avance",null,"BANQUE",null,null,"CAISSE",null,null,"Situation générale","PRODUITS",null,null,null,null,null,null,null,null,"CHARGES"]
["N°   P.J.","Date","Pointage","Libellé\n\nNature de l'opération  /  Numéro du chèque","Reçu la\nsomme\nde :","Versé la\nsomme\nde :","Entrées","Sorties","Situation","Entrées","Sorties","Situation",null,70700008,70800008,74100008,75511008,75510008,75620008,76700008,77000008,"validité",60700008,61810008,65860008,61681008,62700008,67000008,68000008]
[null,null,"bancaire",null,null,null,null,null,null,null,null,null,null,"Cessions\nde produits","Produits des activités éducatives","Subventions reçues collectivités locales","Contributions financières d'autres organismes","Contributions financières plateforme participative","Participations volontaires des familles","Produits financiers","Produits excep-tionnels ",null,"Achats de produits pour cession","Charges des activités éducatives","Cotisations statutaires versées à l'OCCE","Assurance versée à l'OCCE","Frais bancaires","Charges excep-tionnelles","Achats de biens durables"]
[null,null,"ou"]
[null,null,"postal"]
[null,null,"Préciser le n° de relevé","BILAN A LA DERNIERE OPERATION",{"$f":"E316","v":0},0,0,0,0,0,0,0,0,0,0,0,0,0,0,0,0,null,{"$f":"W316","v":0},0,0,0,0,0,0]
[null,null,null,"REPORT (frapper valeur ccp/banque et/ou caisse)",null,null,null,null,null,null,null,null,{"$f":"IF(I7+L7=0,\"\",I7+L7)","v":""}]
[1,null,null,null,null,null,null,null,{"$f":"IF(D8=\"\",\"\",I7+G8-H8)","v":""},null,null,{"$f":"IF(D8=\"\",\"\",L7+J8-K8)","v":""},{"$f":"IF(D8=\"\",\"\",I8+L8)","v":""},null,null,null,null,null,null,null,null,{"$f":"IF(E8+F8+G8+H8+J8+K8=0,IF(N8+O8+P8+Q8+R8+S8+T8+U8+W8+X8+Y8+Z8+AA8+AB8+AC8>0,\"Classe\",\"\"),IF(OR(AND(E8<>0,F8=0,SUM(N8:U8)=0,SUM(W8:AC8)=0,H8+K8=0,G8+J8=E8),AND(F8<>0,E8=0,SUM(N8:U8)=0,SUM(W8:AC8)=0,G8+J8=0,H8+K8=F8),AND(E8=0,F8=0,H8+K8<>0,H8+K8=SUM(W8:AC8),SUM(N8:U8)=0,(H8+K8)<>(G8+J8)),AND(E8=0,F8=0,G8+J8<>0,G8+J8=SUM(N8:U8),SUM(W8:AC8)=0,(H8+K8)<>(G8+J8)),AND(E8=0,F8=0,J8=0,N8+O8+P8+Q8+R8+S8+T8+U8+W8+X8+Y8+Z8+AA8+AB8+AC8=0,K8<>0,K8=G8),AND(E8=0,F8=0,J8<>0,N8+O8+P8+Q8+R8+S8+T8+U8+W8+X8+Y8+Z8+AA8+AB8+AC8=0,K8=0,J8=H8)),\"OK\",\"??\"))","v":""}]
[2,null,null,null,null,null,null,null,"",null,null,"","",null,null,null,null,null,null,null,null,""]
[3,null,null,null,null,null,null,null,"",null,null,"","",null,null,null,null,null,null,null,null,""]
{"$rows_left_out":307}
{"sheet":"BILAN","index":3,"n_rows":38,"n_cols":8,"rows_kept":38,"cut":false,"hidden":false,"merged":[[36,0,36,3],[36,4,36,7],[37,5,37,6],[32,0,34,2],[32,3,34,3],[34,6,34,7],[35,0,35,2],[35,4,35,6],[24,0,24,2],[25,0,25,2],[26,0,28,3],[29,0,31,2],[29,3,31,3],[20,4,20,6],[21,0,21,1],[21,4,21,6],[23,0,23,3],[23,4,23,7],[17,0,17,2],[17,4,17,7],[18,0,19,0],[18,1,19,1],[18,2,19,2],[11,0,11,1],[11,4,11,6],[13,0,13,3],[13,4,13,5],[15,0,15,7],[7,0,7,1],[7,4,7,6],[8,0,8,1],[8,4,8,6],[9,0,9,1],[9,4,9,6],[4,0,4,1],[4,4,4,6],[5,0,5,1],[5,4,5,6],[6,0,6,1],[6,4,6,6],[0,0,0,7],[1,0,1,7],[2,0,2,2],[2,4,2,7],[3,0,3,1],[3,4,3,6]]}
[{"$f":"\"Compte de fonctionnement général du 1er septembre \"&Coordonnées!B10&\" au 31 août \"&Coordonnées!B11","v":"Compte de fonctionnement général du 1er septembre 2025 au 31 août 2026"}]
[]
["CHARGES",null,null,null,"PRODUITS"]
["60700008 - Achats de produits pour cession",null,{"$f":"LIVRE!W6","v":0},null,"70700008 - Ventes de produits pour cession",null,null,{"$f":"LIVRE!N6","v":0}]
["61681008 - Assurances versées à l'OCCE",null,{"$f":"LIVRE!Z6","v":0},null,"70800008 - Produits des activités éducatives",null,null,{"$f":"LIVRE!O6","v":0}]
["61810008 - Charges des activités éducatives",null,{"$f":"LIVRE!X6","v":0},null,"74100008 - Subventions Etat, Collectivités loc.",null,null,{"$f":"LIVRE!P6","v":0}]
["65860008 - Cotisations versées à l'OCCE",null,{"$f":"LIVRE!Y6","v":0},null,"75511008 - Contrib. Fi. Autres organismes",null,null,{"$f":"LIVRE!Q6","v":0}]
["62700008 - Frais bancaires",null,{"$f":"LIVRE!AA6","v":0},null,"7510008 - Contribution Plateforme participative",null,null,{"$f":"LIVRE!R6","v":0}]
["67000008 - Charges exceptionnelles",null,{"$f":"LIVRE!AB6","v":0},null,"75620008 - Participation volontaire des familles",null,null,{"$f":"LIVRE!S6","v":0}]
["68000008 - Achats de biens durables",null,{"$f":"LIVRE!AC6","v":0},null,"77000008 - Produits exceptionnels",null,null,{"$f":"LIVRE!U6","v":0}]
{"$rows_left_out":29}
{"sheet":"Rapprochement bancaire","index":4,"n_rows":51,"n_cols":5,"rows_kept":51,"cut":false,"hidden":false,"merged":[[10,0,10,2],[12,0,12,4],[14,0,14,2],[0,0,0,4],[2,0,2,4],[4,0,4,3],[6,0,6,3],[8,0,8,3]]}
[{"$f":"Coordonnées!B2&\" \"&\"- \"&Coordonnées!B4","v":" - "}]
[]
[{"$f":"\"Rapprochement bancaire avec le compte n° \"&Coordonnées!B7","v":"Rapprochement bancaire avec le compte n° "}]
[]
["Solde du compte bancaire en comptabilité :",null,null,null,{"$f":"LIVRE!I6","v":0}]
[null,null,null,null,"-"]
["Total des opérations non encaissées :",null,null,null,{"$f":"D51","v":0}]
[null,null,null,null,"+"]
["Total des opérations non débitées :",null,null,null,{"$f":"E51","v":0}]
[]
{"$rows_left_out":42}
{"sheet":"Gestion analytique des Projets ","index":5,"n_rows":64,"n_cols":36,"rows_kept":64,"cut":false,"hidden":false,"merged":[[6,1,7,1],[6,10,7,10],[6,19,7,19],[6,28,7,28],[3,32,3,35],[4,5,4,8],[4,14,4,17],[4,23,4,26],[4,32,4,35],[0,2,0,27],[1,5,1,17],[1,23,1,26],[3,5,3,8],[3,14,3,17],[3,23,3,26]]}
[null,null,"GESTION ANALYTIQUE DES PROJETS DE LA COOPERATIVE SCOLAIRE"]
[null,null,"Nom de l'école  :",null,null,{"$f":"Coordonnées!B2&\" \"&\"- \"&Coordonnées!B4","v":" - "},null,null,null,null,null,null,null,null,null,null,null,null,null,null,"Année scolaire :",null,null,{"$f":"Coordonnées!B10&\"/\"&Coordonnées!B11","v":"2025/2026"}]
[]
[null,null,null,null,null,"budget accordé",null,null,null,null,null,null,null,null,"budget accordé",null,null,null,null,null,null,null,null,"budget accordé",null,null,null,null,null,null,null,null,"budget accordé"]
[null,null,"Intitulé de l'action 1 :",null,null,null,null,null,null,null,null,"Intitulé de l'action 2 :",null,null,null,null,null,null,null,null,"Intitulé de l'action 3 :",{"$f":"IF(Q5=\"\",\"\",VLOOKUP(Q5,LIVRE!$A$8:$AC$315,8))","v":""},null,null,null,null,null,null,null,"Intitulé de l'action 4 :",{"$f":"IF(Z5=\"\",\"\",VLOOKUP(Z5,LIVRE!$A$8:$AC$315,8))","v":""}]
[null,"PJ","Nature de l'opération",null,null,"Recettes",null,null,"Dépenses",null,"PJ","Nature de l'opération",null,null,"Recettes",null,null,"Dépenses",null,"PJ","Nature de l'opération",null,null,"Recettes",null,null,"Dépenses",null,"PJ","Nature de l'opération",null,null,"Recettes",null,null,"Dépenses"]
[null,null,"Solde","Entrées Banque","Entrées Caisse","Bilan recettes","Sorties Banque","Sorties Caisse","Bilan dépenses",null,null,"Solde","Entrées Banque","Entrées Caisse","Bilan recettes","Sorties Banque","Sorties Caisse","Bilan dépenses",null,null,"Solde","Entrées Banque","Entrées Caisse","Bilan recettes","Sorties Banque","Sorties Caisse","Bilan dépenses",null,null,"Solde","Entrées Banque","Entrées Caisse","Bilan recettes","Sorties Banque","Sorties Caisse","Bilan dépenses"]
[null,null,{"$f":"F64-I64","v":0},null,null,{"$f":"F64","v":0},null,null,{"$f":"I64","v":0},null,null,{"$f":"O64-R64","v":0},null,null,{"$f":"O64","v":0},null,null,{"$f":"R64","v":0},null,null,{"$f":"X64-AA64","v":0},null,null,{"$f":"X64","v":0},null,null,{"$f":"AA64","v":0},null,null,{"$f":"AG64-AJ64","v":0},null,null,{"$f":"AG64","v":0},null,null,{"$f":"AJ64","v":0}]
[null,null,{"$f":"IF(B9=\"\",\"\",VLOOKUP(B9,LIVRE!$A$8:$AC$315,4))","v":""},{"$f":"IF(B9=\"\",\"\",VLOOKUP(B9,LIVRE!$A$8:$AC$315,7))","v":""},{"$f":"IF(B9=\"\",\"\",VLOOKUP(B9,LIVRE!$A$8:$AC$315,10))","v":""},{"$f":"IF(B9=\"\",\"\",D9+E9)","v":""},{"$f":"IF(B9=\"\",\"\",VLOOKUP(B9,LIVRE!$A$8:$AC$315,8))","v":""},{"$f":"IF(B9=\"\",\"\",VLOOKUP(B9,LIVRE!$A$8:$AC$315,11))","v":""},{"$f":"IF(B9=\"\",\"\",G9+H9)","v":""},null,null,{"$f":"IF(K9=\"\",\"\",VLOOKUP(K9,LIVRE!$A$8:$AC$315,4))","v":""},{"$f":"IF(K9=\"\",\"\",VLOOKUP(K9,LIVRE!$A$8:$AC$315,7))","v":""},{"$f":"IF(K9=\"\",\"\",VLOOKUP(K9,LIVRE!$A$8:$AC$315,10))","v":""},{"$f":"IF(K9=\"\",\"\",M9+N9)","v":""},{"$f":"IF(K9=\"\",\"\",VLOOKUP(K9,LIVRE!$A$8:$AC$315,8))","v":""},{"$f":"IF(K9=\"\",\"\",VLOOKUP(K9,LIVRE!$A$8:$AC$315,11))","v":""},{"$f":"IF(K9=\"\",\"\",P9+Q9)","v":""},null,null,{"$f":"IF(T9=\"\",\"\",VLOOKUP(T9,LIVRE!$A$8:$AC$315,4))","v":""},{"$f":"IF(T9=\"\",\"\",VLOOKUP(T9,LIVRE!$A$8:$AC$315,7))","v":""},{"$f":"IF(T9=\"\",\"\",VLOOKUP(T9,LIVRE!$A$8:$AC$315,10))","v":""},{"$f":"IF(T9=\"\",\"\",V9+W9)","v":""},{"$f":"IF(T9=\"\",\"\",VLOOKUP(T9,LIVRE!$A$8:$AC$315,8))","v":""},{"$f":"IF(T9=\"\",\"\",VLOOKUP(T9,LIVRE!$A$8:$AC$315,11))","v":""},{"$f":"IF(T9=\"\",\"\",Y9+Z9)","v":""},null,null,{"$f":"IF(AC9=\"\",\"\",VLOOKUP(AC9,LIVRE!$A$8:$AC$315,4))","v":""},{"$f":"IF(AC9=\"\",\"\",VLOOKUP(AC9,LIVRE!$A$8:$AC$315,7))","v":""},{"$f":"IF(AC9=\"\",\"\",VLOOKUP(AC9,LIVRE!$A$8:$AC$315,10))","v":""},{"$f":"IF(AC9=\"\",\"\",AE9+AF9)","v":""},{"$f":"IF(AC9=\"\",\"\",VLOOKUP(AC9,LIVRE!$A$8:$AC$315,8))","v":""},{"$f":"IF(AC9=\"\",\"\",VLOOKUP(AC9,LIVRE!$A$8:$AC$315,11))","v":""},{"$f":"IF(AC9=\"\",\"\",AH9+AI9)","v":""}]
[null,null,{"$f":"IF(B10=\"\",\"\",VLOOKUP(B10,LIVRE!$A$8:$AC$315,4))","v":""},{"$f":"IF(B10=\"\",\"\",VLOOKUP(B10,LIVRE!$A$8:$AC$315,7))","v":""},{"$f":"IF(B10=\"\",\"\",VLOOKUP(B10,LIVRE!$A$8:$AC$315,10))","v":""},"",{"$f":"IF(B10=\"\",\"\",VLOOKUP(B10,LIVRE!$A$8:$AC$315,8))","v":""},{"$f":"IF(B10=\"\",\"\",VLOOKUP(B10,LIVRE!$A$8:$AC$315,11))","v":""},"",null,null,{"$f":"IF(K10=\"\",\"\",VLOOKUP(K10,LIVRE!$A$8:$AC$315,4))","v":""},{"$f":"IF(K10=\"\",\"\",VLOOKUP(K10,LIVRE!$A$8:$AC$315,7))","v":""},{"$f":"IF(K10=\"\",\"\",VLOOKUP(K10,LIVRE!$A$8:$AC$315,10))","v":""},"",{"$f":"IF(K10=\"\",\"\",VLOOKUP(K10,LIVRE!$A$8:$AC$315,8))","v":""},{"$f":"IF(K10=\"\",\"\",VLOOKUP(K10,LIVRE!$A$8:$AC$315,11))","v":""},"",null,null,{"$f":"IF(T10=\"\",\"\",VLOOKUP(T10,LIVRE!$A$8:$AC$315,4))","v":""},{"$f":"IF(T10=\"\",\"\",VLOOKUP(T10,LIVRE!$A$8:$AC$315,7))","v":""},{"$f":"IF(T10=\"\",\"\",VLOOKUP(T10,LIVRE!$A$8:$AC$315,10))","v":""},"",{"$f":"IF(T10=\"\",\"\",VLOOKUP(T10,LIVRE!$A$8:$AC$315,8))","v":""},{"$f":"IF(T10=\"\",\"\",VLOOKUP(T10,LIVRE!$A$8:$AC$315,11))","v":""},"",null,null,{"$f":"IF(AC10=\"\",\"\",VLOOKUP(AC10,LIVRE!$A$8:$AC$315,4))","v":""},{"$f":"IF(AC10=\"\",\"\",VLOOKUP(AC10,LIVRE!$A$8:$AC$315,7))","v":""},{"$f":"IF(AC10=\"\",\"\",VLOOKUP(AC10,LIVRE!$A$8:$AC$315,10))","v":""},"",{"$f":"IF(AC10=\"\",\"\",VLOOKUP(AC10,LIVRE!$A$8:$AC$315,8))","v":""},{"$f":"IF(AC10=\"\",\"\",VLOOKUP(AC10,LIVRE!$A$8:$AC$315,11))","v":""},""]
{"$rows_left_out":55}
{"sheet":"Projets (suite)","index":6,"n_rows":64,"n_cols":36,"rows_kept":64,"cut":false,"hidden":false,"merged":[[6,1,7,1],[6,10,7,10],[6,19,7,19],[6,28,7,28],[3,32,3,35],[4,5,4,8],[4,14,4,17],[4,23,4,26],[4,32,4,35],[0,2,0,27],[1,5,1,17],[1,23,1,26],[3,5,3,8],[3,14,3,17],[3,23,3,26]]}
[null,null,"GESTION ANALYTIQUE DES PROJETS DE LA COOPERATIVE SCOLAIRE"]
[null,null,"Nom de l'école  :",null,null,{"$f":"Coordonnées!B2&\" \"&\"- \"&Coordonnées!B4","v":" - "},null,null,null,null,null,null,null,null,null,null,null,null,null,null,"Année scolaire :",null,null,{"$f":"Coordonnées!B10&\"/\"&Coordonnées!B11","v":"2025/2026"}]
[]
[null,null,null,null,null,"budget accordé",null,null,null,null,null,null,null,null,"budget accordé",null,null,null,null,null,null,null,null,"budget accordé",null,null,null,null,null,null,null,null,"budget accordé"]
[null,null,"Intitulé de l'action 5 :",null,null,null,null,null,null,null,null,"Intitulé de l'action 6 :",null,null,null,null,null,null,null,null,"Intitulé de l'action 7 :",{"$f":"IF(Q5=\"\",\"\",VLOOKUP(Q5,LIVRE!$A$8:$AC$315,8))","v":""},null,null,null,null,null,null,null,"Intitulé de l'action 8 :",{"$f":"IF(Z5=\"\",\"\",VLOOKUP(Z5,LIVRE!$A$8:$AC$315,8))","v":""}]
[null,"PJ","Nature de l'opération",null,null,"Recettes",null,null,"Dépenses",null,"PJ","Nature de l'opération",null,null,"Recettes",null,null,"Dépenses",null,"PJ","Nature de l'opération",null,null,"Recettes",null,null,"Dépenses",null,"PJ","Nature de l'opération",null,null,"Recettes",null,null,"Dépenses"]
[null,null,"Solde","Entrées Banque","Entrées Caisse","Bilan recettes","Sorties Banque","Sorties Caisse","Bilan dépenses",null,null,"Solde","Entrées Banque","Entrées Caisse","Bilan recettes","Sorties Banque","Sorties Caisse","Bilan dépenses",null,null,"Solde","Entrées Banque","Entrées Caisse","Bilan recettes","Sorties Banque","Sorties Caisse","Bilan dépenses",null,null,"Solde","Entrées Banque","Entrées Caisse","Bilan recettes","Sorties Banque","Sorties Caisse","Bilan dépenses"]
[null,null,{"$f":"F64-I64","v":0},null,null,{"$f":"F64","v":0},null,null,{"$f":"I64","v":0},null,null,{"$f":"O64-R64","v":0},null,null,{"$f":"O64","v":0},null,null,{"$f":"R64","v":0},null,null,{"$f":"X64-AA64","v":0},null,null,{"$f":"X64","v":0},null,null,{"$f":"AA64","v":0},null,null,{"$f":"AG64-AJ64","v":0},null,null,{"$f":"AG64","v":0},null,null,{"$f":"AJ64","v":0}]
[null,null,{"$f":"IF(B9=\"\",\"\",VLOOKUP(B9,LIVRE!$A$8:$AC$315,4))","v":""},{"$f":"IF(B9=\"\",\"\",VLOOKUP(B9,LIVRE!$A$8:$AC$315,7))","v":""},{"$f":"IF(B9=\"\",\"\",VLOOKUP(B9,LIVRE!$A$8:$AC$315,10))","v":""},{"$f":"IF(B9=\"\",\"\",D9+E9)","v":""},{"$f":"IF(B9=\"\",\"\",VLOOKUP(B9,LIVRE!$A$8:$AC$315,8))","v":""},{"$f":"IF(B9=\"\",\"\",VLOOKUP(B9,LIVRE!$A$8:$AC$315,11))","v":""},{"$f":"IF(B9=\"\",\"\",G9+H9)","v":""},null,null,{"$f":"IF(K9=\"\",\"\",VLOOKUP(K9,LIVRE!$A$8:$AC$315,4))","v":""},{"$f":"IF(K9=\"\",\"\",VLOOKUP(K9,LIVRE!$A$8:$AC$315,7))","v":""},{"$f":"IF(K9=\"\",\"\",VLOOKUP(K9,LIVRE!$A$8:$AC$315,10))","v":""},{"$f":"IF(K9=\"\",\"\",M9+N9)","v":""},{"$f":"IF(K9=\"\",\"\",VLOOKUP(K9,LIVRE!$A$8:$AC$315,8))","v":""},{"$f":"IF(K9=\"\",\"\",VLOOKUP(K9,LIVRE!$A$8:$AC$315,11))","v":""},{"$f":"IF(K9=\"\",\"\",P9+Q9)","v":""},null,null,{"$f":"IF(T9=\"\",\"\",VLOOKUP(T9,LIVRE!$A$8:$AC$315,4))","v":""},{"$f":"IF(T9=\"\",\"\",VLOOKUP(T9,LIVRE!$A$8:$AC$315,7))","v":""},{"$f":"IF(T9=\"\",\"\",VLOOKUP(T9,LIVRE!$A$8:$AC$315,10))","v":""},{"$f":"IF(T9=\"\",\"\",V9+W9)","v":""},{"$f":"IF(T9=\"\",\"\",VLOOKUP(T9,LIVRE!$A$8:$AC$315,8))","v":""},{"$f":"IF(T9=\"\",\"\",VLOOKUP(T9,LIVRE!$A$8:$AC$315,11))","v":""},{"$f":"IF(T9=\"\",\"\",Y9+Z9)","v":""},null,null,{"$f":"IF(AC9=\"\",\"\",VLOOKUP(AC9,LIVRE!$A$8:$AC$315,4))","v":""},{"$f":"IF(AC9=\"\",\"\",VLOOKUP(AC9,LIVRE!$A$8:$AC$315,7))","v":""},{"$f":"IF(AC9=\"\",\"\",VLOOKUP(AC9,LIVRE!$A$8:$AC$315,10))","v":""},{"$f":"IF(AC9=\"\",\"\",AE9+AF9)","v":""},{"$f":"IF(AC9=\"\",\"\",VLOOKUP(AC9,LIVRE!$A$8:$AC$315,8))","v":""},{"$f":"IF(AC9=\"\",\"\",VLOOKUP(AC9,LIVRE!$A$8:$AC$315,11))","v":""},{"$f":"IF(AC9=\"\",\"\",AH9+AI9)","v":""}]
[null,null,{"$f":"IF(B10=\"\",\"\",VLOOKUP(B10,LIVRE!$A$8:$AC$315,4))","v":""},{"$f":"IF(B10=\"\",\"\",VLOOKUP(B10,LIVRE!$A$8:$AC$315,7))","v":""},{"$f":"IF(B10=\"\",\"\",VLOOKUP(B10,LIVRE!$A$8:$AC$315,10))","v":""},"",{"$f":"IF(B10=\"\",\"\",VLOOKUP(B10,LIVRE!$A$8:$AC$315,8))","v":""},{"$f":"IF(B10=\"\",\"\",VLOOKUP(B10,LIVRE!$A$8:$AC$315,11))","v":""},"",null,null,{"$f":"IF(K10=\"\",\"\",VLOOKUP(K10,LIVRE!$A$8:$AC$315,4))","v":""},{"$f":"IF(K10=\"\",\"\",VLOOKUP(K10,LIVRE!$A$8:$AC$315,7))","v":""},{"$f":"IF(K10=\"\",\"\",VLOOKUP(K10,LIVRE!$A$8:$AC$315,10))","v":""},"",{"$f":"IF(K10=\"\",\"\",VLOOKUP(K10,LIVRE!$A$8:$AC$315,8))","v":""},{"$f":"IF(K10=\"\",\"\",VLOOKUP(K10,LIVRE!$A$8:$AC$315,11))","v":""},"",null,null,{"$f":"IF(T10=\"\",\"\",VLOOKUP(T10,LIVRE!$A$8:$AC$315,4))","v":""},{"$f":"IF(T10=\"\",\"\",VLOOKUP(T10,LIVRE!$A$8:$AC$315,7))","v":""},{"$f":"IF(T10=\"\",\"\",VLOOKUP(T10,LIVRE!$A$8:$AC$315,10))","v":""},"",{"$f":"IF(T10=\"\",\"\",VLOOKUP(T10,LIVRE!$A$8:$AC$315,8))","v":""},{"$f":"IF(T10=\"\",\"\",VLOOKUP(T10,LIVRE!$A$8:$AC$315,11))","v":""},"",null,null,{"$f":"IF(AC10=\"\",\"\",VLOOKUP(AC10,LIVRE!$A$8:$AC$315,4))","v":""},{"$f":"IF(AC10=\"\",\"\",VLOOKUP(AC10,LIVRE!$A$8:$AC$315,7))","v":""},{"$f":"IF(AC10=\"\",\"\",VLOOKUP(AC10,LIVRE!$A$8:$AC$315,10))","v":""},"",{"$f":"IF(AC10=\"\",\"\",VLOOKUP(AC10,LIVRE!$A$8:$AC$315,8))","v":""},{"$f":"IF(AC10=\"\",\"\",VLOOKUP(AC10,LIVRE!$A$8:$AC$315,11))","v":""},""]
{"$rows_left_out":55}
{"sheet":"Remise espèces","index":7,"n_rows":29,"n_cols":3,"rows_kept":29,"cut":false,"hidden":false,"merged":[[0,0,0,2],[1,0,1,2],[2,0,2,2],[3,0,3,2],[6,0,6,2]]}
[{"$f":"\"OCCE 50 Coopérative scolaire \"&Coordonnées!B6","v":"OCCE 50 Coopérative scolaire "}]
[{"$f":"Coordonnées!B2","v":0}]
[{"$f":"Coordonnées!B3","v":0}]
[{"$f":"Coordonnées!B4","v":0}]
[]
[]
[{"$f":"\"numéro de compte \"&Coordonnées!B7","v":"numéro de compte "}]
[]
["date",{"$f":"TODAY()","v":"2025-03-13"}]
["total remise",null,{"$f":"SUM(C13:C19,C22:C29)","v":0}]
{"$rows_left_out":20}
{"sheet":"Remise chèques","index":8,"n_rows":14,"n_cols":6,"rows_kept":14,"cut":false,"hidden":false,"merged":[[12,0,12,2],[0,0,0,2],[1,0,1,2],[2,0,2,2],[3,0,3,2],[6,0,6,2]]}
[{"$f":"\"OCCE 50 Coopérative scolaire \"&Coordonnées!B6","v":"OCCE 50 Coopérative scolaire "},null,null,null,null,"Banque populaire"]
[{"$f":"Coordonnées!B2","v":0},null,null,null,null,"BNP"]
[{"$f":"Coordonnées!B3","v":0},null,null,null,null,"Caisse d'épargne"]
[{"$f":"Coordonnées!B4","v":0},null,null,null,null,"CIC"]
[null,null,null,null,null,"Crédit Agricole"]
[null,null,null,null,null,"Crédit mutuel"]
[{"$f":"\"numéro de compte \"&Coordonnées!B7","v":"numéro de compte "},null,null,null,null,"LCL"]
[null,null,null,null,null,"Société générale"]
["date",{"$f":"TODAY()","v":"2025-03-13"}]
["total remise",null,{"$f":"SUM(C15:C200)","v":0}]
{"$rows_left_out":5}
{"sheet":"Pièces =","index":9,"n_rows":10,"n_cols":2,"rows_kept":10,"cut":false,"hidden":false,"merged":[[6,1,6,7],[7,1,7,7],[9,1,9,7],[0,0,0,7],[1,0,1,7],[2,0,2,7],[4,1,4,7],[5,1,5,7]]}
["L'Association Départementale OCCE"]
["vous propose des feuilles imprimables"]
["correspondant à des documents comptables vierges…"]
[]
[1,"Pièce comptable type"]
[2,"Pièce de régie d'avance"]
[3,"Bordereau de remise de chèques entre la classe et la coopérative centrale"]
[4,"Bordereau de remise d'éspèces entre la classe et la coopérative centrale"]
[5,"Fiche Navette Ecole -- Famille"]
[6,"Inventaire des biens acquis par la coopérative"]
{"$rows_left_out":1}
{"sheet":"1","index":10,"n_rows":45,"n_cols":7,"rows_kept":45,"cut":false,"hidden":false,"merged":[[36,0,36,6],[38,0,38,6],[43,3,43,5],[43,6,44,6],[44,3,44,5],[26,0,26,6],[28,0,28,6],[30,0,30,6],[32,0,32,6],[34,0,34,6],[16,0,16,6],[18,0,18,6],[20,0,20,6],[22,0,22,6],[24,0,24,6],[6,0,6,6],[8,0,8,6],[10,0,10,6],[12,0,12,6],[14,0,14,6]]}
[null,null,null,null,null,"Pièce n°"]
[]
[]
[null,null,null,null,null,"    Date :","……/……/…………"]
[]
[]
["OBJET"]
[]
[]
[]
{"$rows_left_out":36}
{"sheet":"2","index":11,"n_rows":35,"n_cols":7,"rows_kept":35,"cut":false,"hidden":false,"merged":[[31,0,31,2],[31,3,31,6],[34,3,34,5],[34,6,35,6],[35,3,35,5],[23,0,23,6],[24,0,24,6],[27,0,27,2],[27,3,27,6],[28,0,28,2],[28,3,28,6],[5,0,5,6],[8,1,13,5],[16,0,16,6],[18,0,18,6],[22,0,22,6]]}
[null,null,null,null,null,"Pièce n°"]
[]
[null,null,null,null,null,"    Date :","……/……/…………"]
[]
[]
["Régie d'avance pour la classe de :"]
[]
[]
[null,"Classe :"]
[]
{"$rows_left_out":26}
{"sheet":"3","index":12,"n_rows":43,"n_cols":6,"rows_kept":43,"cut":false,"hidden":false,"merged":[[42,0,42,3],[42,4,42,5],[0,0,0,5],[2,0,2,5],[5,0,5,1],[5,2,5,3],[41,0,41,3]]}
["REMISES DE CHEQUES Classe à la Coopérative centrale"]
[{"$f":"IF(ISBLANK(Coordonnées!B6),\"\",\"Coopérative  scolaire OCCE 50 n° \"&Coordonnées!$B$6)&IF(ISBLANK(Coordonnées!$B$7),\"\",\" compte bancaire n° \"&Coordonnées!B7)","v":""}]
[]
[]
["Action : ",null,null,null,"  Date :  ……/……/…………"]
["Enseignant.e :",null,null,null,"  Classe :"]
[]
["Banque","Nom de l'émetteur du chèque",null,null,null,"Montant"]
[]
[]
{"$rows_left_out":34}
{"sheet":"4","index":13,"n_rows":41,"n_cols":9,"rows_kept":41,"cut":false,"hidden":false,"merged":[[0,0,0,8],[5,1,5,2],[40,3,40,4]]}
["REMISES D'ESPECES de la classe à la coopérative centrale"]
[{"$f":"IF(ISBLANK(Coordonnées!$B$6),\"\",\"Coopérative  scolaire OCCE 50 n° \"&Coordonnées!$B$6)&IF(ISBLANK(Coordonnées!$B$7),\"\",\" compte bancaire n° \"&Coordonnées!$B$7)","v":""}]
[]
[]
["Action : ",null,null,"  Date :  ……/……/…………"]
["Enseignant.e :",null,null,"  Classe :"]
[]
["Nom de l'élève",null,null,null,"Montant"]
[null,null,null,null,null,null,"billets","nombre","total"]
[null,null,null,null,null,null,500]
{"$rows_left_out":32}
{"sheet":"5","index":14,"n_rows":14,"n_cols":5,"rows_kept":14,"cut":false,"hidden":false,"merged":[[22,0,22,4],[23,0,23,4],[24,0,24,4],[25,0,25,4],[0,0,0,4],[6,1,6,2],[6,3,6,4],[12,1,12,2],[12,3,12,4]]}
["FICHE NAVETTE - Parents -- Ecole"]
[]
[]
["NOM de l'élève :   ……………………………………",null,null,"  Année :","…………/…………"]
["Prénom :  ………………………………….",null,null,"Classe : ",",,,,,,,,,,,,,,,,,,,,,,,,,,,,,,,,,,,,,,"]
[]
[null,"Versements",null,"Signatures"]
[null,"Demandé","Reçu","Parent","Enseignant"]
["participation volontaire"]
["participation volontaire"]
{"$rows_left_out":5}
{"sheet":"6","index":15,"n_rows":5,"n_cols":4,"rows_kept":5,"cut":false,"hidden":false,"merged":[[0,0,0,3],[2,0,2,3],[3,0,3,3]]}
["INVENTAIRE DES BIENS ACQUIS PAR LA COOPERATIVE SCOLAIRE"]
[]
[]
["N'oubliez pas de faire une photocopie de la facture d'achat à ranger avec ce tableau"]
["Date de l'achat\n(ou de l'inventaire)","Nature de l'achat","Prix d'achat\nT.T.C","Observations : lieu de rangement, classe ou usage collectif, etc."]